BDBM50374259 CHEMBL257741
SMILES CN(C)Cc1nccn1-c1ccc(N2CCC(NS(=O)(=O)\C=C(/C)c3ccc(Cl)s3)C2=O)c(F)c1
InChI Key InChIKey=CEBGXJOHASCKOD-CCEZHUSRSA-N
Data  1 KI
  Tab Delimited (TSV)   2D SDfile   Computed 3D by Vconf -m prep SDfile
Find this compound or compounds like it in BindingDB:
Activity Spreadsheet -- Enzyme Inhibition Constant Data from BindingDB
Found 1 hit for monomerid = 50374259
TargetCoagulation factor X(Homo sapiens (Human))
Glaxosmithkline
Curated by ChEMBL
LigandPNGBDBM50374259(CHEMBL257741)
Affinity DataKi:  0.200nM. Assay description: Inhibition of factor 10a
In DepthDetails ArticlePubMed