BDBM50374261 CHEMBL270431
SMILES FC1CCN(Cc2nccn2-c2ccc(N3CCC(NS(=O)(=O)\C=C\c4ccc(Cl)s4)C3=O)c(F)c2)C1
InChI Key InChIKey=RQKARFSPMLRNIR-KPKJPENVSA-N
Data  1 KI
  Tab Delimited (TSV)   2D SDfile   Computed 3D by Vconf -m prep SDfile
Find this compound or compounds like it in BindingDB:
Activity Spreadsheet -- Enzyme Inhibition Constant Data from BindingDB
Found 1 hit for monomerid = 50374261
TargetCoagulation factor X(Homo sapiens (Human))
Glaxosmithkline
Curated by ChEMBL
LigandPNGBDBM50374261(CHEMBL270431)
Affinity DataKi:  16.4nM. Assay description: Inhibition of factor 10a
In DepthDetails ArticlePubMed