BDBM50374362 CHEMBL257032
SMILES OC(=O)c1csc(n1)C(=O)CNC(=O)Cc1ccccc1
InChI Key InChIKey=GSGGJUYXOAAERP-UHFFFAOYSA-N
Data  1 KI
  Tab Delimited (TSV)   2D SDfile   Computed 3D by Vconf -m prep SDfile
Find this compound or compounds like it in BindingDB:
Activity Spreadsheet -- Enzyme Inhibition Constant Data from BindingDB
Found 1 hit for monomerid = 50374362
TargetBeta-lactamase(Enterobacter cloacae)
Johnson & Johnson Pharmaceutical Research & Development
Curated by ChEMBL
LigandPNGBDBM50374362(CHEMBL257032)
Affinity DataKi:  1.10E+5nM. Assay description: Inhibition of Enterobacter cloacae beta lactamase
In DepthDetails ArticlePubMed