BDBM50374377 CHEMBL273174
SMILES Nc1nc(N)c(CCCCCC(=O)c2nc3ccccc3o2)c(=O)[nH]1
InChI Key InChIKey=YYLKGGYSOHJCPK-UHFFFAOYSA-N
Data  2 KI
  Tab Delimited (TSV)   2D SDfile   Computed 3D by Vconf -m prep SDfile
Find this compound or compounds like it in BindingDB:
Activity Spreadsheet -- Enzyme Inhibition Constant Data from BindingDB
Found 2 hits for monomerid = 50374377
TargetBifunctional purine biosynthesis protein ATIC(Homo sapiens (Human))
Johnson & Johnson Pharmaceutical Research & Development
Curated by ChEMBL
LigandPNGBDBM50374377(CHEMBL273174)
Affinity DataKi: >1.00E+5nM. Assay description: Inhibition of human aminoimidazole carboxamide transformylase
In DepthDetails ArticlePubMed
TargetTrifunctional purine biosynthetic protein adenosine-3(Homo sapiens (Human))
Johnson & Johnson Pharmaceutical Research & Development
Curated by ChEMBL
LigandPNGBDBM50374377(CHEMBL273174)
Affinity DataKi: >1.00E+5nM. Assay description: Inhibition of human glycinamide ribonucleotide transformylase
In DepthDetails ArticlePubMed