BDBM50375090 CHEMBL257309
SMILES Cc1c(nn(c1-c1ccc(Cl)cc1)-c1ccc(Cl)cc1Cl)-c1nnnn1-c1ccccc1
InChI Key InChIKey=TXGXUEZYEQJBCS-UHFFFAOYSA-N
Data  1 IC50
  Tab Delimited (TSV)   2D SDfile   Computed 3D by Vconf -m prep SDfile
Find this compound or compounds like it in BindingDB:
Activity Spreadsheet -- Enzyme Inhibition Constant Data from BindingDB
Found 1 hit for monomerid = 50375090
TargetCannabinoid receptor 1(Rattus norvegicus (rat))
Reen Cross
Curated by ChEMBL
LigandPNGBDBM50375090(CHEMBL257309)
Affinity DataIC50:  33.8nM. Assay description: Inhibition of cannabinoid CB1 receptor in Sprague-Dawley rat brain
In DepthDetails ArticlePubMed