BDBM50375199 CHEMBL271301
SMILES CC(=O)c1ccc2n(C)c3c4CCc5nn(C)cc5-c4c4C(=O)NCc4c3c2c1
InChI Key InChIKey=MNDLKOGKSGXXRF-UHFFFAOYSA-N
Data  2 IC50
  Tab Delimited (TSV)   2D SDfile   Computed 3D by Vconf -m prep SDfile
Find this compound or compounds like it in BindingDB:
Activity Spreadsheet -- Enzyme Inhibition Constant Data from BindingDB
Found 2 hits for monomerid = 50375199
TargetVascular endothelial growth factor receptor 2(Homo sapiens (Human))
Cephalon
Curated by ChEMBL
LigandPNGBDBM50375199(CHEMBL271301)
Affinity DataIC50:  10nM. Assay description: Inhibition of VEGFR2
In DepthDetails ArticlePubMed
TargetAngiopoietin-1 receptor(Homo sapiens (Human))
Cephalon
Curated by ChEMBL
LigandPNGBDBM50375199(CHEMBL271301)
Affinity DataIC50: >1.00E+4nM. Assay description: Inhibition of TIE2
In DepthDetails ArticlePubMed