BDBM50375559 CHEMBL259898
SMILES C[C@]12CC[C@H]3[C@@H](CC=C4C[C@H](CC[C@]34C)OS(O)(=O)=O)[C@@H]1CCC2=O
InChI Key InChIKey=CZWCKYRVOZZJNM-USOAJAOKSA-N
Data  1 IC50  1 EC50
PDB links: 4 PDB IDs match this monomer.
  Tab Delimited (TSV)   2D SDfile   Computed 3D by Vconf -m prep SDfile
Find this compound or compounds like it in BindingDB:
Activity Spreadsheet -- Enzyme Inhibition Constant Data from BindingDB
Found 2 hits for monomerid = 50375559
TargetATP-binding cassette sub-family C member 4(Homo sapiens (Human))
National University Of Singapore
Curated by ChEMBL
LigandPNGBDBM50375559(CHEMBL259898)
Affinity DataIC50:  3.00E+3nM. Assay description: TP_TRANSPORTER: inhibition of E217betaG uptake in membrane vesicles from MRP4-expressing Sf9 cells
TargetG-protein coupled bile acid receptor 1(Homo sapiens (Human))
Centre National de la Recherche Scientifique/INSERM/ULP
Curated by ChEMBL
LigandPNGBDBM50375559(CHEMBL259898)
Affinity DataEC50:  1.27E+5nM. Assay description: Agonist activity at human TGR5 expressed in CHO cells by luciferase assay
In DepthDetails ArticlePubMed