BDBM50375614 CHEMBL259235
SMILES CO[C@@H]([C@H](O)CC(=O)[C@@H](C)[C@@H](O)CC[C@@H](C)[C@@H]1O[C@]2(CC[C@@H](C)[C@H](CC[C@H](C)C(\C)=N\OCC(=O)NCCNC(=O)c3ccc(cc3OC)C3(N=N3)C(F)(F)F)O2)CC[C@@H]1C)[C@H](OC(=O)C[C@@H](O)C(\C(O)=O)=C(/C)C(O)=O)C(C)C
InChI Key InChIKey=NDTAHHLGUHLZPL-FRVRPJMTSA-N
Data  1 KI
  Tab Delimited (TSV)   2D SDfile   Computed 3D by Vconf -m prep SDfile
Find this compound or compounds like it in BindingDB:
Activity Spreadsheet -- Enzyme Inhibition Constant Data from BindingDB
Found 1 hit for monomerid = 50375614
TargetSerine/threonine-protein phosphatase PP1-gamma catalytic subunit(Homo sapiens (Human))
Nagoya University
Curated by ChEMBL
LigandPNGBDBM50375614(CHEMBL259235)
Affinity DataKi:  21.3nM. Assay description: Inhibition of PP1gamma by firefly bioluminescence assay
In DepthDetails ArticlePubMed