BDBM50375829 CHEMBL409147
SMILES Cn1c(ccc1-c1cc2c(N(CCc3ccccc3)C(=O)C2(C)C)c(F)c1)C#N
InChI Key InChIKey=GVPWNKABXKSXGY-UHFFFAOYSA-N
Data  1 IC50
  Tab Delimited (TSV)   2D SDfile   Computed 3D by Vconf -m prep SDfile
Find this compound or compounds like it in BindingDB:
Activity Spreadsheet -- Enzyme Inhibition Constant Data from BindingDB
Found 1 hit for monomerid = 50375829
TargetProgesterone receptor(Homo sapiens (Human))
Wyeth Research
Curated by ChEMBL
LigandPNGBDBM50375829(CHEMBL409147)
Affinity DataIC50:  351nM. Assay description: Antagonist activity at human PR expressed in human T47D cells assessed as inhibition of progesterone induced alkaline phosphatase
In DepthDetails ArticlePubMed