BDBM50375847 CHEMBL408792
SMILES [#6]\[#6]=[#6](/[#6])-[#6]-[#6]\[#6]=[#6](\[#6])-[#6]-[#6]-[#6]-[#6](-[#6])\[#6]=[#6](/P([#8-])([#8-])=O)P([#8-])([#8-])=O
InChI Key InChIKey=JQRHGBFOFVYWHX-MFZFCEDQSA-J
Data  1 IC50
  Tab Delimited (TSV)   2D SDfile   Computed 3D by Vconf -m prep SDfile
Find this compound or compounds like it in BindingDB:
Activity Spreadsheet -- Enzyme Inhibition Constant Data from BindingDB
Found 1 hit for monomerid = 50375847
TargetGeranylgeranyl pyrophosphate synthase(Homo sapiens (Human))
University Of Iowa
Curated by ChEMBL
LigandPNGBDBM50375847(CHEMBL408792)
Affinity DataIC50:  600nM. Assay description: Inhibition of GST-tagged human recombinant GGDPS expressed in BL21 gold bacteria
In DepthDetails ArticlePubMed