BDBM50375939 CHEMBL259776
SMILES COc1ccccc1N1CCN(CCCC(=O)NCc2nc3ccc(F)cc3c(=O)n2-c2ccccc2)CC1
InChI Key InChIKey=GMMMLQZLHXIAPP-UHFFFAOYSA-N
Data  6 IC50
  Tab Delimited (TSV)   2D SDfile   Computed 3D by Vconf -m prep SDfile
Find this compound or compounds like it in BindingDB:
Activity Spreadsheet -- Enzyme Inhibition Constant Data from BindingDB
Found 6 hits for monomerid = 50375939
Target5-hydroxytryptamine receptor 7(Homo sapiens (Human))
Institute Of Science And Technology
Curated by ChEMBL
LigandPNGBDBM50375939(CHEMBL259776)
Affinity DataIC50:  120nM. Assay description: Displacement of [3H]LSD from human recombinant 5HT7 receptor
In DepthDetails ArticlePubMed
Target5-hydroxytryptamine receptor 1A(Homo sapiens (Human))
Institute Of Science And Technology
Curated by ChEMBL
LigandPNGBDBM50375939(CHEMBL259776)
Affinity DataIC50:  960nM. Assay description: Binding affinity at 5HT1A receptor
In DepthDetails ArticlePubMed
Target5-hydroxytryptamine receptor 7(Homo sapiens (Human))
Institute Of Science And Technology
Curated by ChEMBL
LigandPNGBDBM50375939(CHEMBL259776)
Affinity DataIC50:  120nM. Assay description: Inhibition of 5HT7 receptor by radioligand binding assay
In DepthDetails ArticlePubMed
Target5-hydroxytryptamine receptor 2C(Homo sapiens (Human))
Institute Of Science And Technology
Curated by ChEMBL
LigandPNGBDBM50375939(CHEMBL259776)
Affinity DataIC50:  220nM. Assay description: Binding affinity at 5HT2C receptor
In DepthDetails ArticlePubMed
TargetD(2) dopamine receptor(Homo sapiens (Human))
Institute Of Science And Technology
Curated by ChEMBL
LigandPNGBDBM50375939(CHEMBL259776)
Affinity DataIC50:  5.30E+3nM. Assay description: Binding affinity at dopamine D2 receptor
In DepthDetails ArticlePubMed
Target5-hydroxytryptamine receptor 2A(Homo sapiens (Human))
Institute Of Science And Technology
Curated by ChEMBL
LigandPNGBDBM50375939(CHEMBL259776)
Affinity DataIC50: >1.00E+4nM. Assay description: Binding affinity at 5HT2A receptor
In DepthDetails ArticlePubMed