BDBM50375940 CHEMBL411104
SMILES Cc1ccc(cc1C)N1CCN(CCCC(=O)NCc2nc3ccc(F)cc3c(=O)n2-c2ccccc2)CC1
InChI Key InChIKey=HTPUQSWPDNLQRB-UHFFFAOYSA-N
Data  2 IC50
  Tab Delimited (TSV)   2D SDfile   Computed 3D by Vconf -m prep SDfile
Find this compound or compounds like it in BindingDB:
Activity Spreadsheet -- Enzyme Inhibition Constant Data from BindingDB
Found 2 hits for monomerid = 50375940
Target5-hydroxytryptamine receptor 7(Homo sapiens (Human))
Sharif University Of Technology
Curated by ChEMBL
LigandPNGBDBM50375940(CHEMBL411104)
Affinity DataIC50:  260nM. Assay description: Inhibition of 5HT7 receptor by radioligand binding assay
In DepthDetails ArticlePubMed
Target5-hydroxytryptamine receptor 7(Homo sapiens (Human))
Sharif University Of Technology
Curated by ChEMBL
LigandPNGBDBM50375940(CHEMBL411104)
Affinity DataIC50:  260nM. Assay description: Displacement of [3H]LSD from human recombinant 5HT7 receptor
In DepthDetails ArticlePubMed