BDBM50375963 CHEMBL259408
SMILES Fc1ccc2c(c1)nc(CNC(=O)CCCN1CCN(CC1)c1ccccc1Cl)n(-c1ccccc1)c2=O
InChI Key InChIKey=KVQXSHGOFAZRHT-UHFFFAOYSA-N
Data  2 IC50
  Tab Delimited (TSV)   2D SDfile   Computed 3D by Vconf -m prep SDfile
Find this compound or compounds like it in BindingDB:
Activity Spreadsheet -- Enzyme Inhibition Constant Data from BindingDB
Found 2 hits for monomerid = 50375963
Target5-hydroxytryptamine receptor 7(Homo sapiens (Human))
Sharif University Of Technology
Curated by ChEMBL
LigandPNGBDBM50375963(CHEMBL259408)
Affinity DataIC50:  52nM. Assay description: Inhibition of 5HT7 receptor by radioligand binding assay
In DepthDetails ArticlePubMed
Target5-hydroxytryptamine receptor 7(Homo sapiens (Human))
Sharif University Of Technology
Curated by ChEMBL
LigandPNGBDBM50375963(CHEMBL259408)
Affinity DataIC50:  42nM. Assay description: Displacement of [3H]LSD from human recombinant 5HT7 receptor
In DepthDetails ArticlePubMed