BDBM50376338 CHEMBL411919
SMILES CCC1(CCCCN2CCN(CC2)c2cccc(Cl)c2)C(=O)Nc2ccc(Cl)cc12
InChI Key InChIKey=YFDRVPRNWMMHLM-UHFFFAOYSA-N
Data  1 KI
  Tab Delimited (TSV)   2D SDfile   Computed 3D by Vconf -m prep SDfile
Find this compound or compounds like it in BindingDB:
Activity Spreadsheet -- Enzyme Inhibition Constant Data from BindingDB
Found 1 hit for monomerid = 50376338
Target5-hydroxytryptamine receptor 7(Homo sapiens (Human))
Egis Pharmaceuticals
Curated by ChEMBL
LigandPNGBDBM50376338(CHEMBL411919)
Affinity DataKi:  8.27nM. Assay description: Displacement of [3H]LSD from human recombinant 5HT7 receptor expressed in CHO cells
In DepthDetails ArticlePubMed