BDBM50376481 CHEMBL261051
SMILES FC(F)(F)c1cc2NC(=O)CC(=Nc2cc1Cl)c1cccc(c1)-n1ccnc1
InChI Key InChIKey=KUMADDIKXWCDPV-UHFFFAOYSA-N
Data  2 IC50
  Tab Delimited (TSV)   2D SDfile   Computed 3D by Vconf -m prep SDfile
Find this compound or compounds like it in BindingDB:
Activity Spreadsheet -- Enzyme Inhibition Constant Data from BindingDB
Found 2 hits for monomerid = 50376481
TargetMetabotropic glutamate receptor 2(Homo sapiens (Human))
F. Hoffmann-La Roche
Curated by ChEMBL
LigandPNGBDBM50376481(CHEMBL261051)
Affinity DataIC50:  15nM. Assay description: Antagonist activity at rat mGluR2 assessed as blockade of (1S,3R)-ACPD-induced inhibition of forskolin-stimulated cAMP production
In DepthDetails ArticlePubMed
TargetMetabotropic glutamate receptor 2(Homo sapiens (Human))
F. Hoffmann-La Roche
Curated by ChEMBL
LigandPNGBDBM50376481(CHEMBL261051)
Affinity DataIC50:  17nM. Assay description: Displacement of [3H]LY354740 from rat mGluR2
In DepthDetails ArticlePubMed