BDBM50376579 CHEMBL253754
SMILES CC(=O)NCCCS(=O)(=O)c1ccc2n(CC3CCOCC3)c(nc2c1)C(C)(C)C
InChI Key InChIKey=XDKINWVSXRHNLH-UHFFFAOYSA-N
Data  1 EC50
  Tab Delimited (TSV)   2D SDfile   Computed 3D by Vconf -m prep SDfile
Find this compound or compounds like it in BindingDB:
Activity Spreadsheet -- Enzyme Inhibition Constant Data from BindingDB
Found 1 hit for monomerid = 50376579
TargetCannabinoid receptor 2(Homo sapiens (Human))
Johnson & Johnson Pharmaceutical Research & Development
Curated by ChEMBL
LigandPNGBDBM50376579(CHEMBL253754)
Affinity DataEC50:  100nM. Assay description: Agonist activity at human CB2 receptor
In DepthDetails ArticlePubMed