BDBM50376661 CHEMBL263125
SMILES Cc1ccccc1OCC(=O)Nc1ccc(cc1)-c1nc2cc(ccc2o1)C(F)(F)F
InChI Key InChIKey=NNYNPWQCTGJVFS-UHFFFAOYSA-N
Data  2 IC50
  Tab Delimited (TSV)   2D SDfile   Computed 3D by Vconf -m prep SDfile
Find this compound or compounds like it in BindingDB:
Activity Spreadsheet -- Enzyme Inhibition Constant Data from BindingDB
Found 2 hits for monomerid = 50376661
TargetCholesteryl ester transfer protein(Homo sapiens (Human))
Bristol-Myers Squibb Pharmaceutical Research Institute
Curated by ChEMBL
LigandPNGBDBM50376661(CHEMBL263125)
Affinity DataIC50:  590nM. Assay description: Inhibition of human CETP by scintillation proximity assay
In DepthDetails ArticlePubMed
TargetCholesteryl ester transfer protein(Homo sapiens (Human))
Bristol-Myers Squibb Pharmaceutical Research Institute
Curated by ChEMBL
LigandPNGBDBM50376661(CHEMBL263125)
Affinity DataIC50:  5.10E+4nM. Assay description: Inhibition of CETP in human whole plasma
In DepthDetails ArticlePubMed