BDBM50376666 CHEMBL259446
SMILES Cc1ccccc1OCC(=O)Nc1ccc(cc1)-c1nc2cccc(C(O)=O)c2o1
InChI Key InChIKey=QHZMBVMBLPKGBV-UHFFFAOYSA-N
Data  1 IC50
  Tab Delimited (TSV)   2D SDfile   Computed 3D by Vconf -m prep SDfile
Find this compound or compounds like it in BindingDB:
Activity Spreadsheet -- Enzyme Inhibition Constant Data from BindingDB
Found 1 hit for monomerid = 50376666
TargetCholesteryl ester transfer protein(Homo sapiens (Human))
Bristol-Myers Squibb Pharmaceutical Research Institute
Curated by ChEMBL
LigandPNGBDBM50376666(CHEMBL259446)
Affinity DataIC50: >3.20E+4nM. Assay description: Inhibition of human CETP by scintillation proximity assay
In DepthDetails ArticlePubMed