BDBM50376674 CHEMBL260012
SMILES COC(=O)c1ccc2oc(nc2c1)-c1ccc(NC(=O)COc2ccccc2C)cc1
InChI Key InChIKey=SFOJWLQZRIIKKI-UHFFFAOYSA-N
Data  1 IC50
  Tab Delimited (TSV)   2D SDfile   Computed 3D by Vconf -m prep SDfile
Find this compound or compounds like it in BindingDB:
Activity Spreadsheet -- Enzyme Inhibition Constant Data from BindingDB
Found 1 hit for monomerid = 50376674
TargetCholesteryl ester transfer protein(Homo sapiens (Human))
Bristol-Myers Squibb Pharmaceutical Research Institute
Curated by ChEMBL
LigandPNGBDBM50376674(CHEMBL260012)
Affinity DataIC50: >3.20E+4nM. Assay description: Inhibition of human CETP by scintillation proximity assay
In DepthDetails ArticlePubMed