BDBM50376703 CHEMBL259801
SMILES Cc1cc(C)c2oc(nc2c1)-c1ccc(NC(=O)COc2ccccc2C(F)(F)F)cc1
InChI Key InChIKey=IICIVLBBDHVVJR-UHFFFAOYSA-N
Data  2 IC50
  Tab Delimited (TSV)   2D SDfile   Computed 3D by Vconf -m prep SDfile
Find this compound or compounds like it in BindingDB:
Activity Spreadsheet -- Enzyme Inhibition Constant Data from BindingDB
Found 2 hits for monomerid = 50376703
TargetCholesteryl ester transfer protein(Homo sapiens (Human))
Bristol-Myers Squibb Pharmaceutical Research Institute
Curated by ChEMBL
LigandPNGBDBM50376703(CHEMBL259801)
Affinity DataIC50:  9.10E+4nM. Assay description: Inhibition of CETP in human whole plasma
In DepthDetails ArticlePubMed
TargetCholesteryl ester transfer protein(Homo sapiens (Human))
Bristol-Myers Squibb Pharmaceutical Research Institute
Curated by ChEMBL
LigandPNGBDBM50376703(CHEMBL259801)
Affinity DataIC50:  1.90E+3nM. Assay description: Inhibition of human CETP by scintillation proximity assay
In DepthDetails ArticlePubMed