BDBM50376709 CHEMBL258961
SMILES Cc1cc(C)c2oc(nc2c1)-c1ccc(NC(=O)COc2ccc(OC(F)(F)F)cc2)cc1
InChI Key InChIKey=UKHLSOJGHXUXNV-UHFFFAOYSA-N
Data  1 IC50
  Tab Delimited (TSV)   2D SDfile   Computed 3D by Vconf -m prep SDfile
Find this compound or compounds like it in BindingDB:
Activity Spreadsheet -- Enzyme Inhibition Constant Data from BindingDB
Found 1 hit for monomerid = 50376709
TargetCholesteryl ester transfer protein(Homo sapiens (Human))
Bristol-Myers Squibb Pharmaceutical Research Institute
Curated by ChEMBL
LigandPNGBDBM50376709(CHEMBL258961)
Affinity DataIC50: >1.00E+4nM. Assay description: Inhibition of human CETP by scintillation proximity assay
In DepthDetails ArticlePubMed