BDBM50376722 CHEMBL260324
SMILES Cc1ccccc1OCC(=O)Nc1ccc(cc1)-c1nc2cc(cc(c2o1)C(F)(F)F)C(F)(F)F
InChI Key InChIKey=LZWGDCHIGSRFHE-UHFFFAOYSA-N
Data  2 IC50
  Tab Delimited (TSV)   2D SDfile   Computed 3D by Vconf -m prep SDfile
Find this compound or compounds like it in BindingDB:
Activity Spreadsheet -- Enzyme Inhibition Constant Data from BindingDB
Found 2 hits for monomerid = 50376722
TargetCholesteryl ester transfer protein(Homo sapiens (Human))
Bristol-Myers Squibb Pharmaceutical Research Institute
Curated by ChEMBL
LigandPNGBDBM50376722(CHEMBL260324)
Affinity DataIC50:  92nM. Assay description: Inhibition of human CETP by scintillation proximity assay
In DepthDetails ArticlePubMed
TargetCholesteryl ester transfer protein(Homo sapiens (Human))
Bristol-Myers Squibb Pharmaceutical Research Institute
Curated by ChEMBL
LigandPNGBDBM50376722(CHEMBL260324)
Affinity DataIC50:  9.10E+3nM. Assay description: Inhibition of CETP in human whole plasma
In DepthDetails ArticlePubMed