BDBM50376910 CHEMBL264946
SMILES O=c1n(Cc2ccc(cc2)-c2ccccc2-c2nnn[nH]2)cc2[nH]cccc12
InChI Key InChIKey=IUCMQNUOWXGGBC-UHFFFAOYSA-N
Data  1 IC50
  Tab Delimited (TSV)   2D SDfile   Computed 3D by Vconf -m prep SDfile
Find this compound or compounds like it in BindingDB:
Activity Spreadsheet -- Enzyme Inhibition Constant Data from BindingDB
Found 1 hit for monomerid = 50376910
TargetType-1 angiotensin II receptor A(RAT)
Universit£
Curated by ChEMBL
LigandPNGBDBM50376910(CHEMBL264946)
Affinity DataIC50: >1.00E+4nM. Assay description: Displacement of [125I]Sar1,Ile8-Ang2 from AT1 receptor in Wistar rat hepatic membrane
In DepthDetails ArticlePubMed