BDBM50377006 CHEMBL402189
SMILES COc1cc(CC(=O)N(C)[C@H](CN2CCCC2)c2ccccc2)c(cc1OC)S(=O)(=O)N1CCOCC1
InChI Key InChIKey=NMAGBJWNYCHJFX-HSZRJFAPSA-N
Data  3 KI  1 EC50
  Tab Delimited (TSV)   2D SDfile   Computed 3D by Vconf -m prep SDfile
Find this compound or compounds like it in BindingDB:
Activity Spreadsheet -- Enzyme Inhibition Constant Data from BindingDB
Found 4 hits for monomerid = 50377006
TargetKappa-type opioid receptor(Homo sapiens (Human))
Adolor
Curated by ChEMBL
LigandPNGBDBM50377006(CHEMBL402189)
Affinity DataKi:  0.550nM. Assay description: Displacement of [3H]diprenorphine from human kappa opioid receptor expressed in CHO-K1 cells
In DepthDetails ArticlePubMed
TargetDelta-type opioid receptor(Homo sapiens (Human))
Adolor
Curated by ChEMBL
LigandPNGBDBM50377006(CHEMBL402189)
Affinity DataKi:  9.40nM. Assay description: Displacement of [3H]diprenorphine from human delta opioid receptor expressed in CHO-K1 cells
In DepthDetails ArticlePubMed
TargetMu-type opioid receptor(Homo sapiens (Human))
Adolor
Curated by ChEMBL
LigandPNGBDBM50377006(CHEMBL402189)
Affinity DataKi:  15nM. Assay description: Displacement of [3H]diprenorphine from human mu opioid receptor expressed in CHO-K1 cells
In DepthDetails ArticlePubMed
TargetKappa-type opioid receptor(Homo sapiens (Human))
Adolor
Curated by ChEMBL
LigandPNGBDBM50377006(CHEMBL402189)
Affinity DataEC50:  0.170nM. Assay description: Agonist activity at human kappa opioid receptor transfected in CHO cells by [35S]GTP-gamma-S binding assay
In DepthDetails ArticlePubMed