BDBM50377096 CHEMBL260418
SMILES O=c1cc(OCCCn2c3ccccc3c3ccccc23)ccn1Cc1ccccc1
InChI Key InChIKey=JVMMVAMVYZNGOE-UHFFFAOYSA-N
Data  1 IC50
  Tab Delimited (TSV)   2D SDfile   Computed 3D by Vconf -m prep SDfile
Find this compound or compounds like it in BindingDB:
Activity Spreadsheet -- Enzyme Inhibition Constant Data from BindingDB
Found 1 hit for monomerid = 50377096
TargetEnoyl-[acyl-carrier-protein] reductase [NADH] FabI(Bacillus subtilis (strain 168))
University Of Illinois At Chicago
Curated by ChEMBL
LigandPNGBDBM50377096(CHEMBL260418)
Affinity DataIC50: >1.00E+5nM. Assay description: Inhibition of Bacillus anthracis Enoyl ACP reductase
In DepthDetails ArticlePubMed