BDBM50377155 CHEMBL256513
SMILES NCCCNc1cccc(n1)-c1cnc2ccccn12
InChI Key InChIKey=IIYVXYXKYNUIAE-UHFFFAOYSA-N
Data  1 IC50
  Tab Delimited (TSV)   2D SDfile   Computed 3D by Vconf -m prep SDfile
Find this compound or compounds like it in BindingDB:
Activity Spreadsheet -- Enzyme Inhibition Constant Data from BindingDB
Found 1 hit for monomerid = 50377155
TargetInterleukin-1 receptor-associated kinase 4(Homo sapiens (Human))
Ucb Pharma
Curated by ChEMBL
LigandPNGBDBM50377155(CHEMBL256513)
Affinity DataIC50:  1.30E+3nM. Assay description: Inhibition of IRAK4
In DepthDetails ArticlePubMed