BDBM50377374 CHEMBL405478
SMILES Nc1nc(cs1)-c1ccc(cc1F)C(F)(F)F
InChI Key InChIKey=WTMCMRXAHVSYMO-UHFFFAOYSA-N
Data  1 EC50
  Tab Delimited (TSV)   2D SDfile   Computed 3D by Vconf -m prep SDfile
Find this compound or compounds like it in BindingDB:
Activity Spreadsheet -- Enzyme Inhibition Constant Data from BindingDB
Found 1 hit for monomerid = 50377374
TargetThrombopoietin receptor(Homo sapiens (Human))
Pfizer
Curated by ChEMBL
LigandPNGBDBM50377374(CHEMBL405478)
Affinity DataEC50:  260nM. Assay description: Agonist activity at TPO receptor
In DepthDetails ArticlePubMed