BDBM50377377 CHEMBL412807
SMILES Nc1nc(cs1)-c1c(F)cccc1F
InChI Key InChIKey=ZRFCBSGOMCOUJG-UHFFFAOYSA-N
Data  1 EC50
  Tab Delimited (TSV)   2D SDfile   Computed 3D by Vconf -m prep SDfile
Find this compound or compounds like it in BindingDB:
Activity Spreadsheet -- Enzyme Inhibition Constant Data from BindingDB
Found 1 hit for monomerid = 50377377
TargetThrombopoietin receptor(Homo sapiens (Human))
Pfizer
Curated by ChEMBL
LigandPNGBDBM50377377(CHEMBL412807)
Affinity DataEC50: >1.00E+4nM. Assay description: Agonist activity at TPO receptor
In DepthDetails ArticlePubMed