BDBM50377461 CHEMBL405027
SMILES FC(F)(F)c1nc(C(=O)c2ccncc2)c2sccc2n1
InChI Key InChIKey=DVGFEHLWKVFWRZ-UHFFFAOYSA-N
Data  2 KI
  Tab Delimited (TSV)   2D SDfile   Computed 3D by Vconf -m prep SDfile
Find this compound or compounds like it in BindingDB:
Activity Spreadsheet -- Enzyme Inhibition Constant Data from BindingDB
Found 2 hits for monomerid = 50377461
TargetAdenosine receptor A2a(Homo sapiens (Human))
Vernalis (R&D)
Curated by ChEMBL
LigandPNGBDBM50377461(CHEMBL405027)
Affinity DataKi:  1.38E+3nM. Assay description: Binding affinity to human adenosine A2A receptor
In DepthDetails ArticlePubMed
TargetAdenosine receptor A1(Homo sapiens (Human))
Vernalis (R&D)
Curated by ChEMBL
LigandPNGBDBM50377461(CHEMBL405027)
Affinity DataKi:  1.45E+4nM. Assay description: Binding affinity to human adenosine A1 receptor
In DepthDetails ArticlePubMed