BDBM50377543 CHEMBL260146
SMILES Nc1nc(-c2ccco2)c2cnn(C(=O)NCc3ccccc3)c2n1
InChI Key InChIKey=QJFITZRFGJYVRW-UHFFFAOYSA-N
Data  2 KI
  Tab Delimited (TSV)   2D SDfile   Computed 3D by Vconf -m prep SDfile
Find this compound or compounds like it in BindingDB:
Activity Spreadsheet -- Enzyme Inhibition Constant Data from BindingDB
Found 2 hits for monomerid = 50377543
TargetAdenosine receptor A2a(Homo sapiens (Human))
Vernalis (R&D)
Curated by ChEMBL
LigandPNGBDBM50377543(CHEMBL260146)
Affinity DataKi:  1nM. Assay description: Binding affinity at human adenosine A2A receptor
In DepthDetails ArticlePubMed
TargetAdenosine receptor A1(Homo sapiens (Human))
Vernalis (R&D)
Curated by ChEMBL
LigandPNGBDBM50377543(CHEMBL260146)
Affinity DataKi:  13nM. Assay description: Binding affinity at human adenosine A1 receptor
In DepthDetails ArticlePubMed