BDBM50377830 CHEMBL401806
SMILES COc1ccc(cc1)C(=O)C(=C)CN1CCC(Cc2ccccc2)CC1
InChI Key InChIKey=UQILZUNDEHUPRM-UHFFFAOYSA-N
Data  1 KI  1 IC50  1 EC50
  Tab Delimited (TSV)   2D SDfile   Computed 3D by Vconf -m prep SDfile
Find this compound or compounds like it in BindingDB:
Activity Spreadsheet -- Enzyme Inhibition Constant Data from BindingDB
Found 3 hits for monomerid = 50377830
TargetGlutamate receptor ionotropic, NMDA 2B(Rattus norvegicus (Rat))
University Of Strasburg
Curated by ChEMBL
LigandPNGBDBM50377830(CHEMBL401806)
Affinity DataKi:  527nM. Assay description: Displacement of [3H]ifenprodil from rat brain membrane NR2B receptor
In DepthDetails ArticlePubMed
TargetGlutamate receptor ionotropic, NMDA 1/2A(Homo sapiens (Human))
University Of Strasburg
Curated by ChEMBL
LigandPNGBDBM50377830(CHEMBL401806)
Affinity DataEC50: >1.00E+5nM. Assay description: Activity at NR1/NR2A receptor expressed in xenopus oocytes assessed as effect on L-glutamate and glycine-induced current response
In DepthDetails ArticlePubMed
TargetGlutamate receptor ionotropic, NMDA 1/2B(Homo sapiens (Human))
University Of Strasburg
Curated by ChEMBL
LigandPNGBDBM50377830(CHEMBL401806)
Affinity DataIC50:  7.00E+4nM. Assay description: Inhibition of NR1/NR2B receptor expressed in xenopus oocytes assessed as effect on L-glutamate and glycine-induced current response
In DepthDetails ArticlePubMed