BDBM50378120 CHEMBL609987
SMILES CC(=O)NC(Cc1cc(F)cc(F)c1)C(O)CNC1(CCc2[nH]ncc2C1)c1cccc(c1)C(C)(C)C
InChI Key InChIKey=BAILJXDQIBWAPX-UHFFFAOYSA-N
Data  2 IC50
PDB links: 1 PDB ID matches this monomer.
  Tab Delimited (TSV)   2D SDfile   Computed 3D by Vconf -m prep SDfile
Find this compound or compounds like it in BindingDB:
Activity Spreadsheet -- Enzyme Inhibition Constant Data from BindingDB
Found 2 hits for monomerid = 50378120
TargetCathepsin D(Homo sapiens (Human))
Elan Pharmaceuticals
Curated by ChEMBL
LigandPNGBDBM50378120(CHEMBL609987)
Affinity DataIC50:  300nM. Assay description: Inhibition of cathepsin D assessed as reduction in polarization after 110 mins by oregon green based fluorescence polarization assay
In DepthDetails ArticlePubMed
TargetBeta-secretase 1(Homo sapiens (Human))
Elan Pharmaceuticals
Curated by ChEMBL
LigandPNGBDBM50378120(CHEMBL609987)
Affinity DataIC50:  12nM. Assay description: Inhibition of recombinant BACE1 expressed in Escherichia coli after 3 hrs by oregon green based fluorescence polarization assay