BDBM50378160 CHEMBL4161684
SMILES CCOC(=O)c1noc2c1C(=O)c1ncccc1C2=O
InChI Key InChIKey=STGXNSQQPDARPC-UHFFFAOYSA-N
Data  2 IC50
  Tab Delimited (TSV)   2D SDfile   Computed 3D by Vconf -m prep SDfile
Find this compound or compounds like it in BindingDB:
Activity Spreadsheet -- Enzyme Inhibition Constant Data from BindingDB
Found 2 hits for monomerid = 50378160
TargetTyrosyl-DNA phosphodiesterase 2(Homo sapiens (Human))
Sun Yat-Sen University
Curated by ChEMBL
LigandPNGBDBM50378160(CHEMBL4161684)
Affinity DataIC50:  3.10E+3nM. Assay description: Inhibition of human TDP2 expressed in TDP2 deficient chicken DT40 whole cell extracts using TY19 DNA as substrate after 15 mins by by PAGE analysis
In DepthDetails ArticlePubMed
TargetTyrosyl-DNA phosphodiesterase 2(Homo sapiens (Human))
Sun Yat-Sen University
Curated by ChEMBL
LigandPNGBDBM50378160(CHEMBL4161684)
Affinity DataIC50:  3.30E+3nM. Assay description: Inhibition of recombinant human TDP2 using TY18 (alpha-[32P]-cordycepin-3'-labeled) as substrate after 15 mins by PAGE analysis
In DepthDetails ArticlePubMed