BDBM50378313 CHEMBL567626
SMILES CC(C)n1cnc2c(NCc3ccc(s3)-c3ccsc3)nc(N[C@H]3CC[C@H](N)CC3)nc12
InChI Key InChIKey=RLFMPFNGRWVLRL-QAQDUYKDSA-N
Data  2 IC50
  Tab Delimited (TSV)   2D SDfile   Computed 3D by Vconf -m prep SDfile
Find this compound or compounds like it in BindingDB:
Activity Spreadsheet -- Enzyme Inhibition Constant Data from BindingDB
Found 2 hits for monomerid = 50378313
TargetCyclin-A1/Cyclin-A2/Cyclin-dependent kinase 2(Homo sapiens (Human))
Amri
Curated by ChEMBL
LigandPNGBDBM50378313(CHEMBL567626)
Affinity DataIC50:  0.300nM. Assay description: Inhibition of recombinant Cdk2/cyclinA
In DepthDetails ArticlePubMed
LigandPNGBDBM50378313(CHEMBL567626)
Affinity DataIC50:  0.200nM. Assay description: Inhibition of Cdk2/cyclinE
In DepthDetails ArticlePubMed