BDBM50378379 CHEMBL575299
SMILES COc1cccc(c1)N1C(N)=NC(N)=NC11CCCCC1
InChI Key InChIKey=WJKIDBQCXNLTLB-UHFFFAOYSA-N
Data  2 IC50
  Tab Delimited (TSV)   2D SDfile   Computed 3D by Vconf -m prep SDfile
Find this compound or compounds like it in BindingDB:
Activity Spreadsheet -- Enzyme Inhibition Constant Data from BindingDB
Found 2 hits for monomerid = 50378379
TargetBile salt export pump(Homo sapiens (Human))
Astrazeneca
Curated by ChEMBL
LigandPNGBDBM50378379(CHEMBL575299)
Affinity DataIC50: >1.00E+6nM. Assay description: Inhibition of human BSEP expressed in baculovirus transfected fall armyworm Sf21 cell membranes vesicles assessed as reduction in ATP-dependent [3H]-...
In DepthDetails ArticlePubMed
TargetDihydrofolate reductase(Bos taurus (Cattle))
National University Of Singapore
Curated by ChEMBL
LigandPNGBDBM50378379(CHEMBL575299)
Affinity DataIC50: >1.00E+5nM. Assay description: Inhibition of bovine liver DHFR assessed as NADPH consumption during conversion of dihydrofolic acid to tetrahydrofolic acid
In DepthDetails ArticlePubMed