BDBM50378382 CHEMBL573274
SMILES CC1(C)NC(Nc2ccccc2Cl)=NC(N)=N1
InChI Key InChIKey=NFAPARBFVDLKOR-UHFFFAOYSA-N
Data  1 IC50
  Tab Delimited (TSV)   2D SDfile   Computed 3D by Vconf -m prep SDfile
Find this compound or compounds like it in BindingDB:
Activity Spreadsheet -- Enzyme Inhibition Constant Data from BindingDB
Found 1 hit for monomerid = 50378382
TargetDihydrofolate reductase(Bos taurus (Cattle))
National University Of Singapore
Curated by ChEMBL
LigandPNGBDBM50378382(CHEMBL573274)
Affinity DataIC50: >1.00E+5nM. Assay description: Inhibition of bovine liver DHFR assessed as NADPH consumption during conversion of dihydrofolic acid to tetrahydrofolic acid
In DepthDetails ArticlePubMed