BDBM50378499 CHEMBL565293
SMILES CCOC(=O)c1ncn-2c1Cn1cnnc1-c1cc(F)ccc-21
InChI Key InChIKey=FCSMWBVLHQSWGU-UHFFFAOYSA-N
Data  1 KI
  Tab Delimited (TSV)   2D SDfile   Computed 3D by Vconf -m prep SDfile
Find this compound or compounds like it in BindingDB:
Activity Spreadsheet -- Enzyme Inhibition Constant Data from BindingDB
Found 1 hit for monomerid = 50378499
TargetGABA-A receptor; alpha-5/beta-3/gamma-2(Homo sapiens (Human))
F. Hoffmann-La Roche
Curated by ChEMBL
LigandPNGBDBM50378499(CHEMBL565293)
Affinity DataKi:  1.70nM. Assay description: Binding affinity to GABAA alpha-5-beta-3-gamma-2 receptor
In DepthDetails ArticlePubMed