BDBM50378516 CHEMBL565316
SMILES CCOC(=O)c1ncn-2c1Cn1c(Cc3ccccc3)nnc1-c1cc(Br)ccc-21
InChI Key InChIKey=CMBWNHOKELKKKB-UHFFFAOYSA-N
Data  1 KI
  Tab Delimited (TSV)   2D SDfile   Computed 3D by Vconf -m prep SDfile
Find this compound or compounds like it in BindingDB:
Activity Spreadsheet -- Enzyme Inhibition Constant Data from BindingDB
Found 1 hit for monomerid = 50378516
TargetGABA-A receptor; alpha-5/beta-3/gamma-2(Homo sapiens (Human))
F. Hoffmann-La Roche
Curated by ChEMBL
LigandPNGBDBM50378516(CHEMBL565316)
Affinity DataKi:  19.1nM. Assay description: Binding affinity to GABAA alpha-5-beta-3-gamma-2 receptor
In DepthDetails ArticlePubMed