BDBM50378533 CHEMBL568192
SMILES N[C@H]([C@H](O)C(O)=O)C(O)=O
InChI Key InChIKey=YYLQUHNPNCGKJQ-NCGGTJAESA-N
Data  1 KI
PDB links: 1 PDB ID matches this monomer.
  Tab Delimited (TSV)   2D SDfile   Computed 3D by Vconf -m prep SDfile
Find this compound or compounds like it in BindingDB:
Activity Spreadsheet -- Enzyme Inhibition Constant Data from BindingDB
Found 1 hit for monomerid = 50378533
TargetSerine racemase(Mus musculus)
Institute Of Organic Chemistry And Biochemistry Of The Ascr
Curated by ChEMBL
LigandPNGBDBM50378533(CHEMBL568192)
Affinity DataKi:  4.30E+4nM. Assay description: Inhibition of mouse recombinant serine racemase transfected in bacterial expression system
In DepthDetails ArticlePubMed