BDBM50378586 CHEMBL611465
SMILES CCc1nc2c(cccn2c1-c1cccc(Oc2cccc(c2)S(C)(=O)=O)c1)C(F)(F)F
InChI Key InChIKey=WZXCTCJIJVBAOX-UHFFFAOYSA-N
Data  2 IC50  2 EC50
  Tab Delimited (TSV)   2D SDfile   Computed 3D by Vconf -m prep SDfile
Find this compound or compounds like it in BindingDB:
Activity Spreadsheet -- Enzyme Inhibition Constant Data from BindingDB
Found 4 hits for monomerid = 50378586
TargetOxysterols receptor LXR-beta(Homo sapiens (Human))
Wyeth Pharmaceuticals
Curated by ChEMBL
LigandPNGBDBM50378586(CHEMBL611465)
Affinity DataEC50:  1.22E+3nM. Assay description: Agonist activity at human Gal4-LBD fused LXRbeta LBD expressed in Huh7 cells by transient transactivation assay
In DepthDetails ArticlePubMed
TargetOxysterols receptor LXR-alpha(Homo sapiens (Human))
Wyeth Pharmaceuticals
Curated by ChEMBL
LigandPNGBDBM50378586(CHEMBL611465)
Affinity DataIC50:  14nM. Assay description: Displacement of [3H]T0901317 from human recombinant LXRalpha LBD
In DepthDetails ArticlePubMed
TargetOxysterols receptor LXR-alpha(Homo sapiens (Human))
Wyeth Pharmaceuticals
Curated by ChEMBL
LigandPNGBDBM50378586(CHEMBL611465)
Affinity DataEC50:  420nM. Assay description: Agonist activity at human Gal4-LBD fused LXRalpha LBD expressed in Huh7 cells by transient transactivation assay
In DepthDetails ArticlePubMed
TargetOxysterols receptor LXR-beta(Homo sapiens (Human))
Wyeth Pharmaceuticals
Curated by ChEMBL
LigandPNGBDBM50378586(CHEMBL611465)
Affinity DataIC50:  217nM. Assay description: Displacement of [3H]T0901317 from human recombinant LXRbeta LBD
In DepthDetails ArticlePubMed