BDBM50378589 CHEMBL611734
SMILES CS(=O)(=O)c1cccc(Oc2cccc(c2)-c2c(nc3c(cccn23)C(F)(F)F)-c2ccccc2)c1
InChI Key InChIKey=GUEIWDLJEBMFMQ-UHFFFAOYSA-N
Data  2 IC50  2 EC50
  Tab Delimited (TSV)   2D SDfile   Computed 3D by Vconf -m prep SDfile
Find this compound or compounds like it in BindingDB:
Activity Spreadsheet -- Enzyme Inhibition Constant Data from BindingDB
Found 4 hits for monomerid = 50378589
TargetOxysterols receptor LXR-beta(Homo sapiens (Human))
Wyeth Pharmaceuticals
Curated by ChEMBL
LigandPNGBDBM50378589(CHEMBL611734)
Affinity DataEC50:  1.11E+3nM. Assay description: Agonist activity at human Gal4-LBD fused LXRbeta LBD expressed in Huh7 cells by transient transactivation assay
In DepthDetails ArticlePubMed
TargetOxysterols receptor LXR-alpha(Homo sapiens (Human))
Wyeth Pharmaceuticals
Curated by ChEMBL
LigandPNGBDBM50378589(CHEMBL611734)
Affinity DataIC50:  7.20nM. Assay description: Displacement of [3H]T0901317 from human recombinant LXRalpha LBD
In DepthDetails ArticlePubMed
TargetOxysterols receptor LXR-beta(Homo sapiens (Human))
Wyeth Pharmaceuticals
Curated by ChEMBL
LigandPNGBDBM50378589(CHEMBL611734)
Affinity DataIC50:  91nM. Assay description: Displacement of [3H]T0901317 from human recombinant LXRbeta LBD
In DepthDetails ArticlePubMed
TargetOxysterols receptor LXR-alpha(Homo sapiens (Human))
Wyeth Pharmaceuticals
Curated by ChEMBL
LigandPNGBDBM50378589(CHEMBL611734)
Affinity DataEC50:  570nM. Assay description: Agonist activity at human Gal4-LBD fused LXRalpha LBD expressed in Huh7 cells by transient transactivation assay
In DepthDetails ArticlePubMed