BDBM50378591 CHEMBL612005
SMILES CS(=O)(=O)c1cccc(Oc2cccc(c2)-c2c(CN3CCCC3)nc3c(cccn23)C(F)(F)F)c1
InChI Key InChIKey=HZBNGPXKCIHTTC-UHFFFAOYSA-N
Data  2 IC50
  Tab Delimited (TSV)   2D SDfile   Computed 3D by Vconf -m prep SDfile
Find this compound or compounds like it in BindingDB:
Activity Spreadsheet -- Enzyme Inhibition Constant Data from BindingDB
Found 2 hits for monomerid = 50378591
TargetOxysterols receptor LXR-alpha(Homo sapiens (Human))
Wyeth Pharmaceuticals
Curated by ChEMBL
LigandPNGBDBM50378591(CHEMBL612005)
Affinity DataIC50:  279nM. Assay description: Displacement of [3H]T0901317 from human recombinant LXRalpha LBD
In DepthDetails ArticlePubMed
TargetOxysterols receptor LXR-beta(Homo sapiens (Human))
Wyeth Pharmaceuticals
Curated by ChEMBL
LigandPNGBDBM50378591(CHEMBL612005)
Affinity DataIC50: >1.00E+3nM. Assay description: Displacement of [3H]T0901317 from human recombinant LXRbeta LBD
In DepthDetails ArticlePubMed