BDBM50378609 CHEMBL601722
SMILES O[C@H](CNC(=O)c1ccc(Cl)cc1)[C@H](O)[C@H]1O[C@@](C[C@@H](O)[C@@H]1NC(=O)CC1CCC1)(OCc1cccc(F)c1F)C([O-])=O
InChI Key InChIKey=PREANLJTMCKYAI-LSVLUGHISA-M
Data  1 Kd
  Tab Delimited (TSV)   2D SDfile   Computed 3D by Vconf -m prep SDfile
Find this compound or compounds like it in BindingDB:
Activity Spreadsheet -- Enzyme Inhibition Constant Data from BindingDB
Found 1 hit for monomerid = 50378609
TargetMyelin-associated glycoprotein(Mus musculus)
University Of Basel
Curated by ChEMBL
LigandPNGBDBM50378609(CHEMBL601722)
Affinity DataKd:  5.80E+3nM. Assay description: Binding affinity to mouse MAGd1-3Fc expressed in CHO-Lec 3.2.8.1 cells by SPR analysis
In DepthDetails ArticlePubMed