BDBM50378622 CHEMBL599003::US8637558, 1
SMILES CC(C)OCCOc1ccc(C=C2SC(O)=NC2=O)cc1
InChI Key InChIKey=FRHCUERMLPXPBY-UHFFFAOYSA-N
Data  2 IC50
  Tab Delimited (TSV)   2D SDfile   Computed 3D by Vconf -m prep SDfile
Find this compound or compounds like it in BindingDB:
Activity Spreadsheet -- Enzyme Inhibition Constant Data from BindingDB
Found 2 hits for monomerid = 50378622
Target15-hydroxyprostaglandin dehydrogenase [NAD(+)](Homo sapiens (Human))
Chosun University
Curated by ChEMBL
LigandPNGBDBM50378622(CHEMBL599003 | US8637558, 1)
Affinity DataIC50:  1.25E+3nM. Assay description: Inhibition of human 15PGDH expressed in Escherichia coli BL-21 by fluorescence spectrophotometry
In DepthDetails ArticlePubMed
Target15-hydroxyprostaglandin dehydrogenase [NAD(+)](Homo sapiens (Human))
Chosun University
Curated by ChEMBL
LigandPNGBDBM50378622(CHEMBL599003 | US8637558, 1)
Affinity DataIC50:  961nMpH: 7.5Assay Description:Experimental was performed by measuring the formation of NADH at 340 nm with a fluorescence spectrophotometer. Specifically, 2 ml (in total) of the s...
In DepthDetails US Patent