BDBM50378644 CHEMBL606032
SMILES O=C1NC(=O)\C(N1)=C\c1ccc(OCCC2CCCCC2)cc1
InChI Key InChIKey=LPESZYRZJSTPLZ-VBKFSLOCSA-N
Data  1 IC50
  Tab Delimited (TSV)   2D SDfile   Computed 3D by Vconf -m prep SDfile
Find this compound or compounds like it in BindingDB:
Activity Spreadsheet -- Enzyme Inhibition Constant Data from BindingDB
Found 1 hit for monomerid = 50378644
Target15-hydroxyprostaglandin dehydrogenase [NAD(+)](Homo sapiens (Human))
Chosun University
Curated by ChEMBL
LigandPNGBDBM50378644(CHEMBL606032)
Affinity DataIC50:  865nM. Assay description: Inhibition of human 15PGDH expressed in Escherichia coli BL-21 by fluorescence spectrophotometry
In DepthDetails ArticlePubMed