BDBM50378825 CHEMBL1242832
SMILES NC(=O)c1ccc2NC(=O)C(=NNc3ccc(cc3)S(=O)(=O)NCCOCCO)c2c1
InChI Key InChIKey=IZCKXSGMKCVBHY-UHFFFAOYSA-N
Data  2 IC50
  Tab Delimited (TSV)   2D SDfile   Computed 3D by Vconf -m prep SDfile
Find this compound or compounds like it in BindingDB:
Activity Spreadsheet -- Enzyme Inhibition Constant Data from BindingDB
Found 2 hits for monomerid = 50378825
TargetCyclin-dependent kinase 2(Homo sapiens (Human))
Georgetown University
Curated by ChEMBL
LigandPNGBDBM50378825(CHEMBL1242832)
Affinity DataIC50:  4.50E+3nM. Assay description: Inhibition of CDK2
In DepthDetails ArticlePubMed
TargetCyclin-dependent kinase 1(Homo sapiens (Human))
Georgetown University
Curated by ChEMBL
LigandPNGBDBM50378825(CHEMBL1242832)
Affinity DataIC50:  2.80E+3nM. Assay description: Inhibition of CDK1
In DepthDetails ArticlePubMed