BDBM50378962 CHEMBL2011244::US9394290, 7
SMILES Fc1ccccc1-c1ccc(Cn2ccnc2)cn1
InChI Key InChIKey=DSMQGRPUCULHMD-UHFFFAOYSA-N
Data  4 IC50
  Tab Delimited (TSV)   2D SDfile   Computed 3D by Vconf -m prep SDfile
Find this compound or compounds like it in BindingDB:
Activity Spreadsheet -- Enzyme Inhibition Constant Data from BindingDB
Found 4 hits for monomerid = 50378962
TargetCytochrome P450 11B1, mitochondrial(Homo sapiens (Human))
Universitaet Des Saarlandes Campus Saarbruecken
US Patent
LigandPNGBDBM50378962(CHEMBL2011244 | US9394290, 7)
Affinity DataIC50:  72nMT: 2°C. Assay description: V79MZ cells expressing human CYP11B1 and human CYP11B2 genes, respectively, were grown on 24-well cell culture plates (8×10^5 cells per well) w...
In DepthDetails US Patent
TargetCytochrome P450 11B2, mitochondrial(Homo sapiens (Human))
TBA
Curated by ChEMBL
LigandPNGBDBM50378962(CHEMBL2011244 | US9394290, 7)
Affinity DataIC50:  1.74E+3nM. Assay description: Inhibition of human CYP11B2 expressed in hamster V79 MZ cells using [3H] 11 deoxycorticosterone as substrate by HPLC radioflow detector
In DepthDetails ArticlePubMed
TargetCytochrome P450 11B1, mitochondrial(Homo sapiens (Human))
Universitaet Des Saarlandes Campus Saarbruecken
US Patent
LigandPNGBDBM50378962(CHEMBL2011244 | US9394290, 7)
Affinity DataIC50:  72nM. Assay description: Inhibition of human CYP11B1 expressed in hamster V79 MZ cells using [3H] 11 deoxycorticosterone as substrate by HPLC radioflow detector
In DepthDetails ArticlePubMed
TargetCytochrome P450 11B2, mitochondrial(Homo sapiens (Human))
TBA
Curated by ChEMBL
LigandPNGBDBM50378962(CHEMBL2011244 | US9394290, 7)
Affinity DataIC50:  1.74E+3nMT: 2°C. Assay description: V79MZ cells expressing human CYP11B1 and human CYP11B2 genes, respectively, were grown on 24-well cell culture plates (8×10^5 cells per well) w...
In DepthDetails US Patent