BDBM50379071 CHEMBL2012386
SMILES C[C@H]1CCC[C@@H](O)[C@@H](O)CCC(=O)Cc2cc(O)cc(O)c2C(=O)O1
InChI Key InChIKey=PEBRFSCYRGJXAP-VQISRLSMSA-N
Data  1 IC50
  Tab Delimited (TSV)   2D SDfile   Computed 3D by Vconf -m prep SDfile
Find this compound or compounds like it in BindingDB:
Activity Spreadsheet -- Enzyme Inhibition Constant Data from BindingDB
Found 1 hit for monomerid = 50379071
TargetMAP kinase-interacting serine/threonine-protein kinase 2(Homo sapiens (Human))
TBA
Curated by ChEMBL
LigandPNGBDBM50379071(CHEMBL2012386)
Affinity DataIC50: >1.00E+4nM. Assay description: Inhibition of MNK2
In DepthDetails ArticlePubMed