BDBM50379305 CHEMBL2011808
SMILES Cc1ccccc1NC(=O)Nc1cccc(N)c1
InChI Key InChIKey=IPFIMHAQYQWDJI-UHFFFAOYSA-N
Data  4 IC50
  Tab Delimited (TSV)   2D SDfile   Computed 3D by Vconf -m prep SDfile
Find this compound or compounds like it in BindingDB:
Activity Spreadsheet -- Enzyme Inhibition Constant Data from BindingDB
Found 4 hits for monomerid = 50379305
TargetATP-dependent RNA helicase DDX3X(Homo sapiens (Human))
University Of Siena
Curated by ChEMBL
LigandPNGBDBM50379305(CHEMBL2011808)
Affinity DataIC50:  4.00E+4nM. Assay description: Inhibition of human recombinant DDX3 ATPase activity expressed in Escherichia coli assessed as [gamma-32P] ATP hydrolysis after 5 mins by densitometr...
In DepthDetails ArticlePubMed
TargetATP-dependent RNA helicase DDX3X(Homo sapiens (Human))
University Of Siena
Curated by ChEMBL
LigandPNGBDBM50379305(CHEMBL2011808)
Affinity DataIC50:  5.00E+3nM. Assay description: Inhibition of DDX3X (unknown origin) helicase activity
In DepthDetails PubMed
TargetATP-dependent RNA helicase DDX1(Homo sapiens (Human))
University Of Siena
Curated by ChEMBL
LigandPNGBDBM50379305(CHEMBL2011808)
Affinity DataIC50: >5.00E+5nM. Assay description: Inhibition of human recombinant DDX1 helicase activity expressed in Escherichia coli assessed as conversion of a 6-FAM-labeled double stranded RNA in...
In DepthDetails ArticlePubMed
TargetATP-dependent RNA helicase DDX3X(Homo sapiens (Human))
University Of Siena
Curated by ChEMBL
LigandPNGBDBM50379305(CHEMBL2011808)
Affinity DataIC50:  5.00E+3nM. Assay description: Inhibition of human recombinant DDX3 helicase activity expressed in Escherichia coli assessed as conversion of a 6-FAM-labeled double stranded RNA in...
In DepthDetails ArticlePubMed