BDBM50379436 CHEMBL2012298
SMILES Fc1ccccc1Cn1ccc2c(OC3CCN(Cc4ccccn4)CC3)ncnc12
InChI Key InChIKey=ZECJEHQTOHGKFP-UHFFFAOYSA-N
Data  1 KI  2 IC50
  Tab Delimited (TSV)   2D SDfile   Computed 3D by Vconf -m prep SDfile
Find this compound or compounds like it in BindingDB:
Activity Spreadsheet -- Enzyme Inhibition Constant Data from BindingDB
Found 3 hits for monomerid = 50379436
TargetPotassium voltage-gated channel subfamily H member 2(Homo sapiens (Human))
Amgen
Curated by ChEMBL
LigandPNGBDBM50379436(CHEMBL2012298)
Affinity DataKi:  1.80E+3nM. Assay description: Displacement of dofetilide from human ERG
In DepthDetails ArticlePubMed
TargetSodium channel protein type 9 subunit alpha(Homo sapiens (Human))
Amgen
Curated by ChEMBL
LigandPNGBDBM50379436(CHEMBL2012298)
Affinity DataIC50:  40nM. Assay description: Antagonist activity at human NaV1.7 channel by patchXpress assay
In DepthDetails ArticlePubMed
TargetSodium channel protein type 5 subunit alpha(Homo sapiens (Human))
Amgen
Curated by ChEMBL
LigandPNGBDBM50379436(CHEMBL2012298)
Affinity DataIC50:  30nM. Assay description: Antagonist activity at human NaV1.5 channel by patchXpress assay
In DepthDetails ArticlePubMed